{"text_format":"3","workbook":"xlsx","n_sheets":3,"sheets":["2020 EOP Rebates","2019 EOP Rebates","Sheet1"],"not_rendered":{"images":3,"macros":1,"defined_names":5},"read":"whole","date_system":"1900"}

{"sheet":"2020 EOP Rebates","index":0,"n_rows":73,"n_cols":18,"rows_kept":73,"merged":[[0,0,0,3],[0,5,0,10],[0,11,0,16],[3,4,3,6],[3,7,3,9],[3,10,3,11],[3,12,3,16],[4,1,6,1],[4,4,6,6],[4,7,6,9],[4,10,6,11],[4,12,6,16],[8,4,8,6],[8,7,8,9],[8,10,8,11],[8,12,8,16],[9,1,11,1],[9,4,11,6],[9,7,11,9],[9,10,11,11],[9,12,11,16],[13,4,13,6],[13,7,13,9],[13,10,13,11],[13,12,13,16],[14,1,16,1],[14,4,16,6],[14,7,16,9],[14,10,16,11],[14,12,16,16],[18,4,18,6],[18,7,18,9],[18,10,18,11],[18,12,18,16],[19,1,21,1],[19,4,21,6],[19,7,21,9],[19,10,21,11],[19,12,21,16],[23,4,23,6],[23,7,23,9],[23,10,23,11],[23,12,23,16],[24,1,26,1],[24,4,26,6],[24,7,26,9],[24,10,26,11],[24,12,26,16],[28,4,28,6],[28,7,28,9],[28,10,28,11],[28,12,28,16],[29,1,31,1],[29,4,31,6],[29,7,31,9],[29,10,31,11],[29,12,31,16],[35,0,37,0],[39,0,40,0],[42,11,42,12],[45,0,46,0],[48,0,49,0],[57,11,57,12],[64,11,64,12],[66,14,66,15],[66,17,66,18],[68,14,68,15],[70,14,70,15],[72,14,72,15]]}
["2020 Early Order Program",{"$nulls":4},"ORDER BY OCTOBER 31 FOR THE BIGGEST SAVINGS"]
[]
[]
["Greens Champion Kit","SKU Number","Number of Units","Acres Covered","Early Order Agency Price",null,null,"Kit Rebate",null,null,"# Kits Purchased",null,"Total Kit Rebate"]
["Fame® SC Fungicide - 64 oz","TBD",4,"8 to 16",{"v":6900,"d":"$6,900"},null,null,{"v":1100,"d":"$1,100"},{"$nulls":4},{"$f":"K5*H5","v":{"v":0,"d":"$0"}}]
["Triple Crown® Golf Insecticide (RUP) 1 gallon",null,4,14.6]
["Rayora™ Fungicide - 2.5 gallon - NEW!",null,2,10.2]
[]
["Fairway Champion Kit","SKU Number","Number of Units","Acres Covered","Early Order Agency Price",null,null,"Kit Rebate",null,null,"# Kits Purchased",null,"Total Kit Rebate"]
["Triple Crown® Golf Insecticide (RUP) 1 gallon",10079184,8,29.3,{"v":13700,"d":"$13,700"},null,null,{"v":2500,"d":"$2,500"},{"$nulls":4},{"$f":"K10*H10","v":{"v":0,"d":"$0"}}]
["Fame® SC Fungicide - 2.5 gallon",null,2,"40 to 53.3"]
["Dismiss® NXT Herbicide - 10 oz",null,8,16]
[]
["Complete Champion Kit","SKU Number","Number of Units","Acres Covered","Early Order Agency Price",null,null,"Kit Rebate",null,null,"# Kits Purchased",null,"Total Kit Rebate"]
["Fame® SC Fungicide - 16 oz",10079181,8,8,{"v":7500,"d":"$7,500"},null,null,{"v":1500,"d":"$1,500"},{"$nulls":4},{"$f":"K15*H15","v":{"v":0,"d":"$0"}}]
["Triple Crown® Golf Insecticide (RUP)  1 gallon",null,8,29.3]
["Echelon® Herbicide - 1 gallon",null,8,28.4]
[]
["Foundation Champion Kit","SKU Number","Number of Units","Acres Covered","Early Order Agency Price",null,null,"Kit Rebate",null,null,"# Kits Purchased",null,"Total Kit Rebate"]
["Solitare® Herbicide - 1 lb",10079185,6,6,{"v":4400,"d":"$4,400"},null,null,{"v":700,"d":"$700"},{"$nulls":4},{"$f":"K20*H20","v":{"v":0,"d":"$0"}}]
["Triple Crown® Golf Insecticide (RUP)  1 gallon",null,4,14.6]
["Echelon® Herbicide - 1 gallon",null,8,28.4]
[]
["Lawn Champion Kit","SKU Number","Number of Units","1000ft2 Coverage","Early Order Agency Price",null,null,"Kit Rebate",null,null,"# Kits Purchased",null,"Total Kit Rebate"]
["Triple Crown® T&O Insecticide - 1gal",10079183,4,640,{"v":6500,"d":"$6,500"},null,null,{"v":1000,"d":"$1,000"},{"$nulls":4},{"$f":"K25*H25","v":{"v":0,"d":"$0"}}]
["Solitare® WSL Herbicide - .75 gallon",null,8,192]
["Fame® SC Fungicide - 64 oz",null,4,"928 to 1,392"]
[]
["Southern Lawn Champion Kit","SKU Number","Number of Units","1000ft2 Coverage","Early Order Agency Price",null,null,"Kit Rebate",null,null,"# Kits Purchased",null,"Total Kit Rebate"]
["Blindside® Herbicide - 0.5 lb",10079178,12,640,{"v":4700,"d":"$4,700"},null,null,{"v":900,"d":"$900"},{"$nulls":4},{"$f":"K30*H30","v":{"v":0,"d":"$0"}}]
["Fame® SC Fungicide - 16 oz",null,8,"464 to 696"]
["Triple Crown® T&O Insecticide - 1 gal",null,4,640]
[]
[]
["Qualifying Products","SKU Number","Unit Size","Agency Price per unit","Sept Spotlight Rebate per Unit","Sept Spotlight # of Units Purchased","Sept Spotlight Total Rebate","Oct Rebate per Unit","Oct \n# of Units Purchased","October Total Rebate","Nov-Dec Rebate per Unit","Nov-Dec\n# of Units Purchased","Nov-Dec Total Rebate","Jan-Feb 15 Rebate per Unit","Jan-Feb 15 \n# of Units Purchased","Jan-Feb 15 Total Rebate","EOP Total Rebate"]
["Fame® SC Fungicide",10064759,"16 oz",{"v":346,"d":"$346"},{"v":40,"d":"$40"},null,{"$f":"E36*F36","v":{"v":0,"d":"$0"}},{"v":32,"d":"$32"},null,{"$f":"H36*I36","v":{"v":0,"d":"$0"}},{"v":25,"d":"$25"},null,{"$f":"K36*L36","v":{"v":0,"d":"$0"}},{"v":15,"d":"$15"},null,{"$f":"N36*O36","v":{"v":0,"d":"$0"}},{"$f":"G36+J36+M36+P36","v":{"v":0,"d":"$0"}}]
[null,10064757,"64 oz",{"v":1299,"d":"$1,299"},{"v":120,"d":"$120"},null,{"v":0,"d":"$0"},{"v":107,"d":"$107"},null,{"v":0,"d":"$0"},{"v":75,"d":"$75"},null,{"v":0,"d":"$0"},{"v":45,"d":"$45"},null,{"v":0,"d":"$0"},{"v":0,"d":"$0"}]
[null,10078970,"2.5 gallon",{"v":5720,"d":"$5,720"},{"v":675,"d":"$675"},null,{"v":0,"d":"$0"},{"v":550,"d":"$550"},null,{"v":0,"d":"$0"},{"v":450,"d":"$450"},null,{"v":0,"d":"$0"},{"v":270,"d":"$270"},null,{"v":0,"d":"$0"},{"v":0,"d":"$0"}]
["Fame® + C Fungicide",10063908,"2.5 gallon",{"v":449,"d":"$449"},{"v":45,"d":"$45"},null,{"v":0,"d":"$0"},{"v":37,"d":"$37"},null,{"v":0,"d":"$0"},{"v":28,"d":"$28"},null,{"v":0,"d":"$0"},{"v":17,"d":"$17"},null,{"v":0,"d":"$0"},{"v":0,"d":"$0"}]
["Fame® + T Fungicide",10076041,"16 oz",{"v":175,"d":"$175"},{"v":20,"d":"$20"},null,{"v":0,"d":"$0"},{"v":16,"d":"$16"},null,{"v":0,"d":"$0"},{"v":12,"d":"$12"},null,{"v":0,"d":"$0"},{"v":7,"d":"$7"},null,{"v":0,"d":"$0"},{"v":0,"d":"$0"}]
[null,10063762,"1 gallon",{"v":1125,"d":"$1,125"},{"v":120,"d":"$120"},null,{"v":0,"d":"$0"},{"v":108,"d":"$108"},null,{"v":0,"d":"$0"},{"v":78,"d":"$78"},null,{"v":0,"d":"$0"},{"v":47,"d":"$47"},null,{"v":0,"d":"$0"},{"v":0,"d":"$0"}]
["Rayora™ Fungicide - NEW!",10079112,"2.5 gallon",{"v":495,"d":"$495"},{"v":100,"d":"$100"},null,{"$f":"E42*F42","v":{"v":0,"d":"$0"}},{"v":75,"d":"$75"},null,{"v":0,"d":"$0"},{"v":50,"d":"$50"},null,{"v":0,"d":"$0"},{"v":30,"d":"$30"},null,{"v":0,"d":"$0"},{"v":0,"d":"$0"}]
[{"$nulls":11},"Fungicide Total",{"$nulls":4},{"$f":"SUM(Q36:Q42)","v":{"v":0,"d":"$0"}}]
[]
["Blindside® Herbicide",10059202,"0.5 lb",{"$nulls":4},{"v":11,"d":"$11"},null,{"$f":"H45*I45","v":{"v":0,"d":"$0"}},{"v":8,"d":"$8"},null,{"$f":"K45*L45","v":{"v":0,"d":"$0"}},{"v":5,"d":"$5"},null,{"$f":"N45*O45","v":{"v":0,"d":"$0"}},{"$f":"J45+M45+P45","v":{"v":0,"d":"$0"}}]
["Dismiss® NXT Herbicide",10077165,"10 oz",{"v":109,"d":"$109"},{"$nulls":3},{"v":20,"d":"$20"},null,{"v":0,"d":"$0"},{"v":15,"d":"$15"},null,{"v":0,"d":"$0"},{"v":10,"d":"$10"},null,{"$f":"N46*O46","v":{"v":0,"d":"$0"}},{"$f":"J46+M46+P46","v":{"v":0,"d":"$0"}}]
[null,10077163,"60 oz",{"v":649,"d":"$649"},{"$nulls":3},{"v":180,"d":"$180"},null,{"v":0,"d":"$0"},{"v":140,"d":"$140"},null,{"v":0,"d":"$0"},{"v":100,"d":"$100"},null,{"$f":"N47*O47","v":{"v":0,"d":"$0"}},{"$f":"J47+M47+P47","v":{"v":0,"d":"$0"}}]
["Dismiss® South Herbicide",10057894,"16 oz",{"$nulls":4},{"v":27,"d":"$27"},null,{"v":0,"d":"$0"},{"v":20,"d":"$20"},null,{"v":0,"d":"$0"},{"v":12,"d":"$12"},null,{"v":0,"d":"$0"},{"v":0,"d":"$0"}]
["Dismiss® Turf Herbicide",10057897,"6 oz",{"$nulls":4},{"v":13,"d":"$13"},null,{"v":0,"d":"$0"},{"v":10,"d":"$10"},null,{"v":0,"d":"$0"},{"v":6,"d":"$6"},null,{"v":0,"d":"$0"},{"v":0,"d":"$0"}]
[null,10058053,"64 oz",{"$nulls":4},{"v":115,"d":"$115"},null,{"v":0,"d":"$0"},{"v":85,"d":"$85"},null,{"v":0,"d":"$0"},{"v":51,"d":"$51"},null,{"v":0,"d":"$0"},{"v":0,"d":"$0"}]
["Dismiss® CA Turf Herbicide",10061363,"6 oz",{"$nulls":4},{"v":13,"d":"$13"},null,{"v":0,"d":"$0"},{"v":10,"d":"$10"},null,{"v":0,"d":"$0"},{"v":6,"d":"$6"},null,{"v":0,"d":"$0"},{"v":0,"d":"$0"}]
["Echelon® 4SC Herbicide",10056927,"1 gallon",{"v":343,"d":"$343"},{"$nulls":3},{"v":30,"d":"$30"},null,{"v":0,"d":"$0"},{"v":23,"d":"$23"},null,{"v":0,"d":"$0"},{"v":14,"d":"$14"},null,{"v":0,"d":"$0"},{"v":0,"d":"$0"}]
["QuickSilver® Herbicide",10053931,"8 oz",{"$nulls":4},{"v":18,"d":"$18"},null,{"v":0,"d":"$0"},{"v":12,"d":"$12"},null,{"v":0,"d":"$0"},{"v":7,"d":"$7"},null,{"v":0,"d":"$0"},{"v":0,"d":"$0"}]
["Solitare® WSL Herbicide",10062872,"3/4 Gal",{"$nulls":4},{"v":6,"d":"$6"},null,{"v":0,"d":"$0"},{"v":4,"d":"$4"},null,{"v":0,"d":"$0"},{"v":4,"d":"$4"},null,{"v":0,"d":"$0"},{"v":0,"d":"$0"}]
["Solitare® Herbicide",10058335,"1 lb",{"$nulls":4},{"v":14,"d":"$14"},null,{"v":0,"d":"$0"},{"v":9,"d":"$9"},null,{"v":0,"d":"$0"},{"v":5,"d":"$5"},null,{"v":0,"d":"$0"},{"v":0,"d":"$0"}]
["Solitare® Herbicide",10061706,"4 lb",{"v":452,"d":"$452"},{"$nulls":3},{"v":50,"d":"$50"},null,{"v":0,"d":"$0"},{"v":35,"d":"$35"},null,{"v":0,"d":"$0"},{"v":21,"d":"$21"},null,{"v":0,"d":"$0"},{"v":0,"d":"$0"}]
["Xonerate® 2SC Herbicide",10077167,"12 oz",{"v":430,"d":"$430"},{"$nulls":3},{"v":70,"d":"$70"},null,{"v":0,"d":"$0"},{"v":45,"d":"$45"},null,{"v":0,"d":"$0"},{"v":18,"d":"$18"},null,{"v":0,"d":"$0"},{"v":0,"d":"$0"}]
[{"$nulls":11},"Herbicide Total",{"$nulls":4},{"$f":"SUM(Q45:Q57)","v":{"v":0,"d":"$0"}}]
[]
["Aria® Insecticide",10061097,"160 grams",{"$nulls":4},{"v":13,"d":"$13"},null,{"$f":"H60*I60","v":{"v":0,"d":"$0"}},{"v":10,"d":"$10"},null,{"$f":"K60*L60","v":{"v":0,"d":"$0"}},{"v":6,"d":"$6"},null,{"$f":"N60*O60","v":{"v":0,"d":"$0"}},{"$f":"J60+M60+P60","v":{"v":0,"d":"$0"}}]
["Talstar® Professional",10056776,"1 gallon",{"$nulls":4},{"v":3,"d":"$3"},null,{"$f":"H61*I61","v":{"v":0,"d":"$0"}},{"v":0,"d":"$0"},null,{"$f":"K61*L61","v":{"v":0,"d":"$0"}},{"v":0,"d":"$0"},null,{"$f":"N61*O61","v":{"v":0,"d":"$0"}},{"$f":"J61+M61+P61","v":{"v":0,"d":"$0"}}]
["Talstar® Select Insecticide (RUP)",10056774,"1 gallon",{"$nulls":4},{"v":3,"d":"$3"},null,{"$f":"H62*I62","v":{"v":0,"d":"$0"}},{"v":2,"d":"$2"},null,{"$f":"K62*L62","v":{"v":0,"d":"$0"}},{"v":1,"d":"$1"},null,{"$f":"N62*O62","v":{"v":0,"d":"$0"}},{"$f":"J62+M62+P62","v":{"v":0,"d":"$0"}}]
["Triple Crown ® Golf Insecticide (RUP)",10061656,"1 gallon",{"v":260,"d":"$260"},{"$nulls":3},{"v":30,"d":"$30"},null,{"$f":"H63*I63","v":{"v":0,"d":"$0"}},{"v":20,"d":"$20"},null,{"$f":"K63*L63","v":{"v":0,"d":"$0"}},{"v":12,"d":"$12"},null,{"$f":"N63*O63","v":{"v":0,"d":"$0"}},{"$f":"J63+M63+P63","v":{"v":0,"d":"$0"}}]
["Triple Crown® T&O Insecticide",10061654,"1 gallon",{"v":260,"d":"$260"},{"$nulls":3},{"v":30,"d":"$30"},null,{"$f":"H64*I64","v":{"v":0,"d":"$0"}},{"v":20,"d":"$20"},null,{"$f":"K64*L64","v":{"v":0,"d":"$0"}},{"v":12,"d":"$12"},null,{"$f":"N64*O64","v":{"v":0,"d":"$0"}},{"$f":"J64+M64+P64","v":{"v":0,"d":"$0"}}]
[{"$nulls":11},"Insecticide Total",{"$nulls":4},{"$f":"SUM(Q60:Q64)","v":{"v":0,"d":"$0"}}]
[]
[{"$nulls":14},"Total Rebate",null,{"$f":"IF(OR(Q65+Q58+Q43+M30+M25+M20+M15+M10+M5>=300),Q65+Q58+Q43+M30+M25+M20+M15+M10+M5,0)","v":{"v":0,"d":"$0"}},{"$f":"IF(Q67<300,\"$300 Rebate Minimum Not Met\",\"\")","v":"$300 Rebate Minimum Not Met"}]
[]
[{"$nulls":14},"RebateLock on Dismiss® NXT ",null,{"$f":"IF(Q67>=900,\"YES\",\"ADD \"&TEXT(900-Q67,\"$#,###\")&\" IN REBATES TO QUALIFY\")","v":"ADD $900 IN REBATES TO QUALIFY"}]
[]
[{"$nulls":14},"RebateLock on Fungicide",null,{"$f":"IF(Q67>=1500,\"YES\",\"ADD \"&TEXT(1500-Q67,\"$#,###\")&\" IN REBATES TO QUALIFY\")","v":"ADD $1,500 IN REBATES TO QUALIFY"}]
[]
[{"$nulls":14},"RebateLock on All Agency",null,{"$f":"IF(Q67>=2000,\"YES\",\"ADD \"&TEXT(2000-Q67,\"$#,###\")&\" IN REBATES TO QUALIFY\")","v":"ADD $2,000 IN REBATES TO QUALIFY"}]

{"sheet":"2019 EOP Rebates","index":1,"n_rows":97,"n_cols":15,"rows_kept":97,"hidden":true,"merged":[[0,0,0,8],[0,10,0,13],[3,4,3,6],[3,7,3,9],[3,10,3,11],[3,12,3,13],[4,1,6,1],[4,4,6,6],[4,7,6,9],[4,10,6,11],[4,12,6,13],[8,4,8,6],[8,7,8,9],[8,10,8,11],[8,12,8,13],[9,1,11,1],[9,4,11,6],[9,7,11,9],[9,10,11,11],[9,12,11,13],[13,4,13,6],[13,7,13,9],[13,10,13,11],[13,12,13,13],[14,1,16,1],[14,4,16,6],[14,7,16,9],[14,10,16,11],[14,12,16,13],[18,4,18,6],[18,7,18,9],[18,10,18,11],[18,12,18,13],[19,1,21,1],[19,4,21,6],[19,7,21,9],[19,10,21,11],[19,12,21,13],[23,4,23,6],[23,7,23,9],[23,10,23,11],[23,12,23,13],[24,1,26,1],[24,4,26,6],[24,7,26,9],[24,10,26,11],[24,12,26,13],[28,4,28,6],[28,7,28,9],[28,10,28,11],[28,12,28,13],[29,1,31,1],[29,4,31,6],[29,7,31,9],[29,10,31,11],[29,12,31,13],[33,4,33,6],[33,7,33,9],[33,10,33,11],[33,12,33,13],[34,1,36,1],[34,4,36,6],[34,7,36,9],[34,10,36,11],[34,12,36,13],[38,4,38,6],[38,7,38,9],[38,10,38,11],[38,12,38,13],[39,1,41,1],[39,4,41,6],[39,7,41,9],[39,10,41,11],[39,12,41,13],[45,0,47,0],[49,0,50,0],[52,11,52,12],[55,0,56,0],[58,0,59,0],[67,11,67,12],[74,11,74,12],[76,11,76,12],[76,14,76,15],[78,11,78,12],[80,11,80,12]]}
["          ORDER BY OCTOBER 31 FOR THE BIGGEST SAVINGS.",{"$nulls":9},"          VISIT FMCTrueChampions.com \n          for full program details."]
["2019 Early Order Program"]
[]
["Tee & Green Champion Kit","SKU Number","Number of Units","Acres Covered","Early Order Agency Price",null,null,"Kit Rebate",null,null,"# Kits Purchased",null,"Total Kit Rebate"]
["Fame® SC Fungicide - 64 oz",10079179,4,16,{"v":7100,"d":"$7,100"},null,null,{"v":1120,"d":"$1,120"},{"$nulls":4},{"$f":"K5*H5","v":{"v":0,"d":"$0"}}]
["Triple Crown® Golf Insecticide (RUP) 1 gallon",null,4,14.6]
["QuickSilver® Herbicide - 8 oz",null,12,14.3]
[]
["Fairway Champion Kit","SKU Number","Number of Units","Acres Covered","Early Order Agency Price",null,null,"Kit Rebate",null,null,"# Kits Purchased",null,"Total Kit Rebate"]
["Triple Crown® Golf Insecticide (RUP) 1 gallon",10079184,8,29.3,{"v":13300,"d":"$13,300"},null,null,{"v":2100,"d":"$2,100"},{"$nulls":4},{"$f":"K10*H10","v":{"v":0,"d":"$0"}}]
["Fame® SC Fungicide - 2.5 gallon",null,2,"40 to 53.3"]
["Dismiss® NXT Herbicide - 10 oz",null,8,16]
[]
["Complete Champion Kit","SKU Number","Number of Units","Acres Covered","Early Order Agency Price",null,null,"Kit Rebate",null,null,"# Kits Purchased",null,"Total Kit Rebate"]
["Fame® SC Fungicide - 16 oz",10079181,8,8,{"v":6900,"d":"$6,900"},null,null,{"v":1100,"d":"$1,100"},{"$nulls":4},{"$f":"K15*H15","v":{"v":0,"d":"$0"}}]
["Triple Crown® Golf Insecticide (RUP)  1 gallon",null,8,29.3]
["Echelon® Herbicide - 1 gallon",null,8,28.4]
[]
["Foundation Champion Kit","SKU Number","Number of Units","Acres Covered","Early Order Agency Price",null,null,"Kit Rebate",null,null,"# Kits Purchased",null,"Total Kit Rebate"]
["Solitare® Herbicide - 1lb",10079185,6,6,{"v":4350,"d":"$4,350"},null,null,{"v":690,"d":"$690"},{"$nulls":4},{"$f":"K20*H20","v":{"v":0,"d":"$0"}}]
["Triple Crown® Golf Insecticide (RUP)  1 gallon",null,4,14.6]
["Echelon® Herbicide - 1 gallon",null,8,28.4]
[]
["California Champion Kit","SKU Number","Number of Units","Acres Covered","Early Order Agency Price",null,null,"Kit Rebate",null,null,"# Kits Purchased",null,"Total Kit Rebate"]
["Fame® SC Fungicide - 64 oz",10079180,4,16,{"v":6400,"d":"$6,400"},null,null,{"v":1000,"d":"$1,000"},{"$nulls":4},{"$f":"K25*H25","v":{"v":0,"d":"$0"}}]
["Dismiss® CA Herbicide - 6 oz",null,12,12]
["QuickSilver® Herbicide - 8 oz",null,8,9.6]
[]
["Cool Season Champion Kit","SKU Number","Number of Units","1000ft2 Coverage","Early Order Agency Price",null,null,"Kit Rebate",null,null,"# Kits Purchased",null,"Total Kit Rebate"]
["Solitare® WSL Herbicide - .75 gallon",10079182,20,480,{"v":3200,"d":"$3,200"},null,null,{"v":500,"d":"$500"},{"$nulls":4},{"$f":"K30*H30","v":{"v":0,"d":"$0"}}]
["QuickSilver® Herbicide - 8 oz",null,4,{"v":1070,"d":"1,070"}]
["Talstar® Professional Insecticide - 1 gallon",null,32,{"v":4096,"d":"4,096"}]
[]
["Lawn Champion Kit","SKU Number","Number of Units","1000ft2 Coverage","Early Order Agency Price",null,null,"Kit Rebate",null,null,"# Kits Purchased",null,"Total Kit Rebate"]
["Triple Crown® T&O Insecticide - 1gal",10079183,4,640,{"v":5950,"d":"$5,950"},null,null,{"v":925,"d":"$925"},{"$nulls":4},{"$f":"K35*H35","v":{"v":0,"d":"$0"}}]
["Solitare® WSL Herbicide - .75 gallon",null,8,192]
["Fame® SC Fungicide - 64 oz",null,4,"928 to 1392"]
[]
["Southeast Lawn Champion Kit","SKU Number","Number of Units","1000ft2 Coverage","Early Order Agency Price",null,null,"Kit Rebate",null,null,"# Kits Purchased",null,"Total Kit Rebate"]
["Blindside® Herbicide - 0.5 lb",10079178,12,640,{"v":4350,"d":"$4,350"},null,null,{"v":675,"d":"$675"},{"$nulls":4},{"$f":"K40*H40","v":{"v":0,"d":"$0"}}]
["Fame® SC Fungicide - 16 oz",null,8,"464 to 696"]
["Triple Crown® T&O Insecticide - 1gal",null,4,640]
[]
[]
["Qualifying Products","SKU Number","Unit Size","Agency Price per unit","Fame First (Sept) Rebate per Unit","Fame First (Sept) # of Units Purchased","Fame First (Sept) Total Rebate","Oct Rebate per Unit","Oct \n# of Units Purchased","October Total Rebate","Nov-Dec Rebate per Unit","Nov-Dec\n# of Units Purchased","Nov-Dec Total Rebate","EOP Total Rebate"]
["Fame® SC Fungicide",10064759,"16 oz",{"v":326,"d":"$326"},{"v":40,"d":"$40"},null,{"$f":"E46*F46","v":{"v":0,"d":"$0"}},{"v":32,"d":"$32"},null,{"$f":"H46*I46","v":{"v":0,"d":"$0"}},{"v":25,"d":"$25"},null,{"$f":"K46*L46","v":{"v":0,"d":"$0"}},{"$f":"G46+J46+M46","v":{"v":0,"d":"$0"}}]
[null,10064757,"64 oz",{"v":1195,"d":"$1,195"},{"v":120,"d":"$120"},null,{"v":0,"d":"$0"},{"v":107,"d":"$107"},null,{"v":0,"d":"$0"},{"v":75,"d":"$75"},null,{"v":0,"d":"$0"},{"v":0,"d":"$0"}]
[null,10078970,"2.5 gallon",{"v":5550,"d":"$5,550"},{"v":725,"d":"$725"},null,{"v":0,"d":"$0"},{"v":550,"d":"$550"},null,{"v":0,"d":"$0"},{"v":425,"d":"$425"},null,{"v":0,"d":"$0"},{"v":0,"d":"$0"}]
["Fame® + C Fungicide",10063908,"2.5 gallon",{"v":422,"d":"$422"},{"v":45,"d":"$45"},null,{"v":0,"d":"$0"},{"v":37,"d":"$37"},null,{"v":0,"d":"$0"},{"v":28,"d":"$28"},null,{"v":0,"d":"$0"},{"v":0,"d":"$0"}]
["Fame® + T Fungicide",10076041,"16 oz",{"v":168,"d":"$168"},{"v":45,"d":"$45"},null,{"v":0,"d":"$0"},{"v":16,"d":"$16"},null,{"v":0,"d":"$0"},{"v":12,"d":"$12"},null,{"v":0,"d":"$0"},{"v":0,"d":"$0"}]
[null,10063762,"1 gallon",{"v":1095,"d":"$1,095"},{"v":275,"d":"$275"},null,{"v":0,"d":"$0"},{"v":108,"d":"$108"},null,{"v":0,"d":"$0"},{"v":78,"d":"$78"},null,{"v":0,"d":"$0"},{"v":0,"d":"$0"}]
["Regime™ Fungicide",10078122,"1 gallon",{"v":358,"d":"$358"},{"$nulls":3},{"v":50,"d":"$50"},null,{"v":0,"d":"$0"},{"v":35,"d":"$35"},null,{"v":0,"d":"$0"},{"v":0,"d":"$0"}]
[{"$nulls":11},"Fungicide Total",null,{"$f":"SUM(N46:N52)","v":{"v":0,"d":"$0"}}]
[]
["Blindside® Herbicide",10059202,"0.5 lb",{"$nulls":4},{"v":11,"d":"$11"},null,{"$f":"H55*I55","v":{"v":0,"d":"$0"}},{"v":8,"d":"$8"},null,{"$f":"K55*L55","v":{"v":0,"d":"$0"}},{"$f":"J55+M55","v":{"v":0,"d":"$0"}}]
["Dismiss® NXT Herbicide",10077165,"10 oz",{"v":109,"d":"$109"},{"$nulls":3},{"v":13,"d":"$13"},null,{"v":0,"d":"$0"},{"v":9,"d":"$9"},null,{"v":0,"d":"$0"},{"v":0,"d":"$0"}]
[null,10077163,"60 oz",{"v":649,"d":"$649"},{"$nulls":3},{"v":140,"d":"$140"},null,{"v":0,"d":"$0"},{"v":100,"d":"$100"},null,{"v":0,"d":"$0"},{"v":0,"d":"$0"}]
["Dismiss® South Herbicide",10057894,"16 oz",{"$nulls":4},{"v":27,"d":"$27"},null,{"v":0,"d":"$0"},{"v":20,"d":"$20"},null,{"v":0,"d":"$0"},{"v":0,"d":"$0"}]
["Dismiss® Turf Herbicide",10057897,"6 oz",{"$nulls":4},{"v":13,"d":"$13"},null,{"v":0,"d":"$0"},{"v":10,"d":"$10"},null,{"v":0,"d":"$0"},{"v":0,"d":"$0"}]
[null,10058053,"64 oz",{"$nulls":4},{"v":115,"d":"$115"},null,{"v":0,"d":"$0"},{"v":85,"d":"$85"},null,{"v":0,"d":"$0"},{"v":0,"d":"$0"}]
["Dismiss® CA Turf Herbicide",10061363,"6 oz",{"$nulls":4},{"v":13,"d":"$13"},null,{"v":0,"d":"$0"},{"v":10,"d":"$10"},null,{"v":0,"d":"$0"},{"v":0,"d":"$0"}]
["Echelon® 4SC Herbicide",10056927,"1 gallon",{"v":331,"d":"$331"},{"$nulls":3},{"v":30,"d":"$30"},null,{"v":0,"d":"$0"},{"v":23,"d":"$23"},null,{"v":0,"d":"$0"},{"v":0,"d":"$0"}]
["QuickSilver® Herbicide",10053931,"8 oz",{"$nulls":4},{"v":18,"d":"$18"},null,{"v":0,"d":"$0"},{"v":12,"d":"$12"},null,{"v":0,"d":"$0"},{"v":0,"d":"$0"}]
["Solitare® WSL Herbicide",10062872,"3/4 Gal",{"$nulls":4},{"v":6,"d":"$6"},null,{"v":0,"d":"$0"},{"v":4,"d":"$4"},null,{"v":0,"d":"$0"},{"v":0,"d":"$0"}]
["Solitare® Herbicide",10058335,"1 lb",{"$nulls":4},{"v":14,"d":"$14"},null,{"v":0,"d":"$0"},{"v":9,"d":"$9"},null,{"v":0,"d":"$0"},{"v":0,"d":"$0"}]
["Solitare® Herbicide",10061706,"4 lb",{"v":452,"d":"$452"},{"$nulls":3},{"v":50,"d":"$50"},null,{"v":0,"d":"$0"},{"v":35,"d":"$35"},null,{"v":0,"d":"$0"},{"v":0,"d":"$0"}]
["Xonerate® 2SC Herbicide",10077167,"12 oz",{"v":410,"d":"$410"},{"$nulls":3},{"v":70,"d":"$70"},null,{"v":0,"d":"$0"},{"v":45,"d":"$45"},null,{"v":0,"d":"$0"},{"v":0,"d":"$0"}]
[{"$nulls":11},"Herbicide Total",null,{"$f":"SUM(N55:N67)","v":{"v":0,"d":"$0"}}]
[]
["Aria® Insecticide",10061097,"160 grams",{"$nulls":4},{"v":13,"d":"$13"},null,{"$f":"H70*I70","v":{"v":0,"d":"$0"}},{"v":10,"d":"$10"},null,{"$f":"K70*L70","v":{"v":0,"d":"$0"}},{"$f":"J70+M70","v":{"v":0,"d":"$0"}}]
["Talstar® Professional",10056776,"1 gallon",{"$nulls":4},{"v":3,"d":"$3"},null,{"$f":"H71*I71","v":{"v":0,"d":"$0"}},{"v":2,"d":"$2"},null,{"$f":"K71*L71","v":{"v":0,"d":"$0"}},{"$f":"J71+M71","v":{"v":0,"d":"$0"}}]
["Talstar® Select Insecticide (RUP)",10056774,"1 gallon",{"$nulls":4},{"v":3,"d":"$3"},null,{"$f":"H72*I72","v":{"v":0,"d":"$0"}},{"v":2,"d":"$2"},null,{"$f":"K72*L72","v":{"v":0,"d":"$0"}},{"$f":"J72+M72","v":{"v":0,"d":"$0"}}]
["Triple Crown ® Golf Insecticide (RUP)",10061656,"1 gallon",{"v":255,"d":"$255"},{"$nulls":3},{"v":30,"d":"$30"},null,{"$f":"H73*I73","v":{"v":0,"d":"$0"}},{"v":20,"d":"$20"},null,{"$f":"K73*L73","v":{"v":0,"d":"$0"}},{"$f":"J73+M73","v":{"v":0,"d":"$0"}}]
["Triple Crown® T&O Insecticide",10061654,"1 gallon",{"v":255,"d":"$255"},{"$nulls":3},{"v":30,"d":"$30"},null,{"$f":"H74*I74","v":{"v":0,"d":"$0"}},{"v":20,"d":"$20"},null,{"$f":"K74*L74","v":{"v":0,"d":"$0"}},{"$f":"J74+M74","v":{"v":0,"d":"$0"}}]
[{"$nulls":11},"Insectide Total",null,{"$f":"SUM(N70:N74)","v":{"v":0,"d":"$0"}}]
[]
[{"$nulls":11},"Total Rebate",null,{"$f":"IF(OR(N75+N68+N53+M40+M35+M30+M25+M20+M15+M10+M5>=300),N75+N68+N53+M40+M35+M30+M25+M20+M15+M10+M5,0)","v":{"v":0,"d":"$0"}},{"$f":"IF(N77<300,\"$300 Rebate Minimum Not Met\",\"\")","v":"$300 Rebate Minimum Not Met"}]
[]
[{"$nulls":11},"RebateLock on Fame® ",null,{"$f":"IF(N77>=2000,\"\",(IF(AND(999<N77,N77<2000),\"YES\",\"ADD \"&TEXT(1000-N77,\"$#,###\")&\" IN REBATES TO QUALIFY\")))","v":"ADD $1,000 IN REBATES TO QUALIFY"}]
[]
[{"$nulls":11},"RebateLock on All Agency",null,{"$f":"IF(N77>=2000,\"YES\",\"ADD \"&TEXT(2000-N77,\"$#,###\")&\" IN REBATES TO QUALIFY\")","v":"ADD $2,000 IN REBATES TO QUALIFY"}]
{"$rows_empty":13}
[{"$nulls":3},"YesNo"]
[{"$nulls":3},"Yes"]
[{"$nulls":3},"No"]

{"sheet":"Sheet1","index":2,"n_rows":14,"n_cols":4,"rows_kept":14,"hidden":true}
["Cool Season Champion Kit","Package Size","Number of Units","1000 ft² Coverage"]
["Solitare WSL ",".75 gal",20,480]
["Quicksilver","8 oz. bottle",4,{"v":1070,"d":"1,070"}]
["Talstar Pro","1 gal",32,{"v":4096,"d":"4,096"}]
[]
["Lawn Champion Kit","Package Size","Number of Units","1000 ft² Coverage"]
["Triple Crown T/O","1 gal",4,640]
["Solitare WSL",".75 gal",8,192]
["Fame SC","64 oz",4,"928 to 1,392"]
[]
["Southeast Lawn Champion Kit","Package Size","Number of Units","1000 ft² Coverage"]
["Blindside","0.5 lb",12,640]
["Fame SC","16 oz",8,"464 to 696"]
["Triple Crown T/O","1 gal",4,640]