{"text_format":"3","workbook":"xlsx","n_sheets":8,"sheets":["Step 1 - Fungicide Planner","Step 2 - Order Planner","Step 2 - OldManage Apps","Step 3 - Review Order","Range Reference","Article Reference","Coverage Reference","Sheet1"],"not_rendered":{"images":6,"macros":1,"defined_names":7,"comments":1},"read":"whole","date_system":"1900"}

{"sheet":"Step 1 - Fungicide Planner","index":0,"n_rows":35,"n_cols":15,"rows_kept":35,"merged":[[16,0,16,9],[17,0,18,0],[17,1,18,1],[17,2,18,2],[17,3,18,3],[17,4,18,4],[17,5,18,5],[17,6,18,6],[17,7,18,7],[17,8,18,8],[17,9,18,9],[21,0,22,0],[23,0,24,0],[26,0,27,0],[28,0,29,0],[30,0,31,0],[33,0,33,9],[34,0,43,9]]}
{"$rows_empty":16}
["Design Your Own Program Fungicide Planner"]
["BASF Brand Name","Case Size","Article No.","Use Area","Acres","Application Rate","Number of Applications","Cases of Product Needed","Cost per Acre\n(before rebate)","Cost per Acre\n(after rebate*)"]
[{"$nulls":10},"Article","Rate","Coverage","Cases"]
["Emerald®",{"$f":"VLOOKUP(C20,'Article Reference'!$A$3:$C$15,3,FALSE)","v":"10 x 0.49 lb"},59021463,null,0,"8.0 oz",0,{"$f":"IF(M20=0,0,(G20*E20)/M20)","v":0},{"$f":"IF(G20*E20=0,0,(ROUND(H20,2)*VLOOKUP(K20,'Step 2 - Order Planner'!$C$26:$D$75,2,FALSE))/(G20*E20))","v":0},{"$f":"IF(G20*E20=0,0,((VLOOKUP(K20,'Step 2 - Order Planner'!$C$26:$D$75,2,FALSE)*(1-'Step 2 - Order Planner'!$B$20))*ROUND(H20,2))/(G20*E20))","v":0},59021463,7,{"$f":"IF(L20=0,0,VLOOKUP(K20,'Coverage Reference'!$B$4:$H$19,L20,FALSE))","v":{"v":10,"d":"10.00"}},{"$f":"H20","v":0}]
["Encartis®",{"$f":"VLOOKUP(C21,'Article Reference'!$A$3:$C$15,3,FALSE)","v":"2 x 2.5 gal"},59014003,null,0,"Select Rate",0,{"$f":"IF(M21=0,0,(G21*E21)/M21)","v":0},{"$f":"IF(G21*E21=0,0,(ROUND(H21,2)*VLOOKUP(K21,'Step 2 - Order Planner'!$C$26:$D$75,2,FALSE))/(G21*E21))","v":0},{"$f":"IF(G21*E21=0,0,((VLOOKUP(K21,'Step 2 - Order Planner'!$C$26:$D$75,2,FALSE)*(1-'Step 2 - Order Planner'!$B$20))*ROUND(H21,2))/(G21*E21))","v":0},59014003,{"$f":"IF(F21=\"130.5 fl oz\",5,IF(F21=\"152.5 fl oz\",6,IF(F21=\"174.0 fl oz\",7,)))","v":0},{"$f":"IF(L21=0,0,VLOOKUP(K21,'Coverage Reference'!$B$4:$H$19,L21,FALSE))","v":0},{"$f":"H21","v":0}]
["Honor® Intrinsic®",{"$f":"VLOOKUP(C22,'Article Reference'!$A$3:$C$15,3,FALSE)","v":"6 x 3 lb"},59012350,null,0,"48.0 oz",0,0,{"$f":"IF(G22*E22=0,0,(ROUND(H22,2)*VLOOKUP(K22,'Step 2 - Order Planner'!$C$26:$D$75,2,FALSE))/(G22*E22))","v":0},{"$f":"IF(G22*E22=0,0,((VLOOKUP(K22,'Step 2 - Order Planner'!$C$26:$D$75,2,FALSE)*(1-'Step 2 - Order Planner'!$B$20))*ROUND(H22,2))/(G22*E22))","v":0},59012350,7,{"$f":"IF(L22=0,0,VLOOKUP(K22,'Coverage Reference'!$B$4:$H$19,L22,FALSE))","v":{"v":6,"d":"6.00"}},{"$f":"H22","v":0}]
[null,{"$f":"VLOOKUP(C23,'Article Reference'!$A$3:$C$15,3,FALSE)","v":"1 x 36 lb"},59012885,null,0,"48.0 oz",0,0,{"$f":"IF(G23*E23=0,0,(ROUND(H23,2)*VLOOKUP(K23,'Step 2 - Order Planner'!$C$26:$D$75,2,FALSE))/(G23*E23))","v":0},{"$f":"IF(G23*E23=0,0,((VLOOKUP(K23,'Step 2 - Order Planner'!$C$26:$D$75,2,FALSE)*(1-'Step 2 - Order Planner'!$B$20))*ROUND(H23,2))/(G23*E23))","v":0},59012885,7,{"$f":"IF(L23=0,0,VLOOKUP(K23,'Coverage Reference'!$B$4:$H$19,L23,FALSE))","v":{"v":12,"d":"12.00"}},0]
["Insignia® SC Intrinsic®",{"$f":"VLOOKUP(C24,'Article Reference'!$A$3:$C$15,3,FALSE)","v":"4 x 30.5 fl oz"},59014134,null,0,"30.5 oz",0,0,{"$f":"IF(G24*E24=0,0,(ROUND(H24,2)*VLOOKUP(K24,'Step 2 - Order Planner'!$C$26:$D$75,2,FALSE))/(G24*E24))","v":0},{"$f":"IF(G24*E24=0,0,((VLOOKUP(K24,'Step 2 - Order Planner'!$C$26:$D$75,2,FALSE)*(1-'Step 2 - Order Planner'!$B$20))*ROUND(H24,2))/(G24*E24))","v":0},59014134,7,{"$f":"IF(L24=0,0,VLOOKUP(K24,'Coverage Reference'!$B$4:$H$19,L24,FALSE))","v":{"v":4,"d":"4.00"}},0,"Greens"]
[null,{"$f":"VLOOKUP(C25,'Article Reference'!$A$3:$C$15,3,FALSE)","v":"2 x 2.5 gal"},59014135,null,0,"30.5 oz",0,0,{"$f":"IF(G25*E25=0,0,(ROUND(H25,2)*VLOOKUP(K25,'Step 2 - Order Planner'!$C$26:$D$75,2,FALSE))/(G25*E25))","v":0},{"$f":"IF(G25*E25=0,0,((VLOOKUP(K25,'Step 2 - Order Planner'!$C$26:$D$75,2,FALSE)*(1-'Step 2 - Order Planner'!$B$20))*ROUND(H25,2))/(G25*E25))","v":0},59014135,7,{"$f":"IF(L25=0,0,VLOOKUP(K25,'Coverage Reference'!$B$4:$H$19,L25,FALSE))","v":{"v":21,"d":"21.00"}},0,"Fairways"]
{"$rows_left_out":11}
{"sheet":"Step 2 - Order Planner","index":1,"n_rows":81,"n_cols":17,"rows_kept":81,"merged":[[6,0,6,8],[7,0,7,8],[8,0,8,8],[14,15,14,16],[15,0,15,8],[15,15,16,16],[16,1,16,2],[16,3,16,6],[16,7,16,8],[17,0,18,0],[17,1,18,2],[17,3,17,6],[17,7,17,8],[17,15,18,15],[17,16,18,16],[18,3,18,6],[18,7,18,8],[19,1,19,2],[19,3,19,6],[19,7,19,8],[19,15,20,15],[19,16,20,16],[20,1,20,2],[20,3,20,6],[20,7,20,8],[21,1,21,2],[21,3,21,6],[21,7,21,8],[21,15,22,15],[21,16,22,16],[22,1,22,2],[22,3,22,6],[22,7,22,8],[38,0,38,4],[38,9,38,11],[39,4,74,4],[39,7,75,8],[40,0,40,3],[40,5,40,6],[46,0,46,3],[46,5,46,6],[51,0,51,3],[51,5,51,6],[64,0,64,3],[64,5,64,6],[70,0,70,3],[70,5,70,6],[75,0,75,4],[75,9,75,11],[80,0,89,8]]}
{"$rows_empty":14}
[{"$nulls":15},"Upgrade Your DYOP Rebate"]
["EOP Rebate Calculator",{"$nulls":14},{"$f":"IF('Range Reference'!S17=0,\"Buy 3 fungicide brands to qualify\",IF('Range Reference'!S17=1,\"Buy 2 more fungicide brands to qualify\",IF('Range Reference'!S17=2,\"Buy 1 more fungicide brand to qualify\",\"Qualified\")))","v":"Buy 3 fungicide brands to qualify"}]
["DYOP Rebate Program Locked",{"$f":"IF(AND(G39>=3000,'Range Reference'!Q17>=1),\"October Rebate Locked\",IF(AND(J39>=3000,'Range Reference'!S17>=3),\"Nov-Dec Rebate Locked\",\"Rebate Level Not Achieved\"))","v":"Rebate Level Not Achieved"},null,"DYOP Total Purchases",{"$nulls":3},{"$f":"G39+I39","v":0}]
["3 or More Fungicide Brands",{"$f":"IF(AND(H17>=3000,'Range Reference'!S17>=3),\"Design Your Own Program Rebate\",\"Need to buy \"&3-'Range Reference'!S17&\" More Brand(s)\")","v":"Need to buy 3 More Brand(s)"},null,"DYOP Rebate",{"$nulls":3},{"$f":"IF(AND(B20=0,B21>0),H17*B21,(B20*H17))","v":0},{"$nulls":7},"Spend for Next DYOP Level","Next Level"]
[{"$nulls":3},"Across-the-Course-Solutions Purchases",{"$nulls":3},{"$f":"G76","v":0}]
["DYOP Rebate",{"$f":"IF(AND('Range Reference'!S17<3,G39>=3000),0.08,'Range Reference'!G16)","v":{"v":0,"d":"0%"}},null,"Across-the-Course-Solutions Rebate",{"$nulls":3},{"$f":"(H19*B21)","v":0},{"$nulls":7},{"$f":"IF(P16<>\"Qualified\",\"\",HLOOKUP(H17,'Range Reference'!$H$10:$H$16,7,FALSE))","v":""},{"$f":"IF(ISNA(IF(P20=0,\"Max\",VLOOKUP(P20,'Range Reference'!H11:I15,2,FALSE)))=TRUE,\"\",IF(P20=0,\"Max\",VLOOKUP(P20,'Range Reference'!H11:I15,2,FALSE)))","v":""}]
["Across-The-Course Rebate",{"$f":"IF(AND('Range Reference'!S17>=3,H17>=20000),0.12,'Range Reference'!G6)","v":{"v":0,"d":"0%"}},null,"TOTAL EOP PURCHASE",{"$nulls":3},{"$f":"H17+H19","v":0}]
["Insignia® Intrinsic® Kicker - 5%",{"$f":"IF((F31+H31)>=1,(G31+I31)*0.05,0)","v":0},null,"Total Effective Rebate on All Purchases",{"$nulls":3},{"$f":"IF(H21=0,0,H23/H21)","v":{"v":0,"d":"0.00%"}},{"$nulls":7},"Spend for Next ATS Level","Next Level"]
["Honor® Intrinsic® Kicker - 5%",{"$f":"IF((F29+H29)>=2,(G29+I29)*0.05,0)","v":0},null,"TOTAL EOP Rebate",{"$nulls":3},{"$f":"(H18+H20)+(B22+B23)","v":0}]
{"$rows_left_out":59}
{"sheet":"Step 2 - OldManage Apps","index":2,"n_rows":40,"n_cols":13,"rows_kept":40,"hidden":true,"merged":[[15,0,15,1],[16,0,16,1],[19,0,19,8],[20,0,21,0],[20,1,21,1],[20,2,21,2],[20,3,20,4],[20,5,20,6],[20,7,20,8],[22,0,23,0],[24,0,25,0],[26,0,27,0],[29,0,30,0],[31,0,32,0],[33,0,34,0],[35,0,36,0],[39,0,46,8]]}
{"$rows_empty":14}
["Enter Acres for your Course (Required)"]
["Fairways & Tees Acres",null,{"v":40,"d":"40.00"}]
["Greens Acres",null,{"v":10,"d":"10.00"}]
[]
["Please complete Yellow \"Use Area\" cells with either Fairways or Greens"]
["Fungicide Planner",{"$nulls":11},"Fairways"]
["Product Name","Case Size","Use Area","Low Rate",null,"Mid Rate",null,"High Rate",{"$nulls":4},"Greens"]
[{"$nulls":3},"Total Acres","Applications","Total Acres","Applications","Total Acres","Applications"]
["Emerald","10 x .49 lb.","Fairways",{"$f":"SUMIFS('Step 2 - Order Planner'!J$26:J$38,'Step 2 - Order Planner'!$C$26:$C$38,$K23)+SUMIFS('Step 2 - Order Planner'!J$42:J$75,'Step 2 - Order Planner'!$C$42:$C$75,$K23)","v":0},{"$f":"IF(OR($C$16=0,$C$17=0),\"Please Enter Acreage\",IF(C23=\"Greens\",D23/$C$17,IF(C23=\"Fairways\",D23/$C$16,0)))","v":0},{"$f":"SUMIFS('Step 2 - Order Planner'!K$26:K$38,'Step 2 - Order Planner'!$C$26:$C$38,$K23)+SUMIFS('Step 2 - Order Planner'!K$42:K$75,'Step 2 - Order Planner'!$C$42:$C$75,$K23)","v":0},{"$f":"IF(OR($C$16=0,$C$17=0),\"Please Enter Acreage\",IF(C23=\"Greens\",F23/$C$17,IF(C23=\"Fairways\",F23/$C$16,0)))","v":0},{"$f":"SUMIFS('Step 2 - Order Planner'!L$26:L$38,'Step 2 - Order Planner'!$C$26:$C$38,$K23)+SUMIFS('Step 2 - Order Planner'!L$42:L$75,'Step 2 - Order Planner'!$C$42:$C$75,$K23)","v":0},{"$f":"IF(OR($C$16=0,$C$17=0),\"Please Enter Acreage\",IF(C23=\"Greens\",H23/$C$17,IF(C23=\"Fairways\",H23/$C$16,0)))","v":0},null,59021463]
{"$rows_left_out":18}
{"sheet":"Step 3 - Review Order","index":3,"n_rows":72,"n_cols":6,"rows_kept":72,"merged":[[10,0,11,5],[18,3,19,4],[18,5,19,5],[21,2,22,3],[38,0,38,4],[69,0,69,4],[71,0,80,5]]}
{"$rows_empty":10}
["BASF 2024 EOP ORDER SUMMARY"]
[]
[{"$f":"NOW()","v":"2023-08-08T16:56:15.450"},null,null,"Rebate Summary"]
["Order For","Order Prepared By",null,"Total Purchase",null,{"$f":"'Step 2 - Order Planner'!H21","v":0}]
["<Enter Customer Name>","<Enter Name>",null,"DYOP Rebate Attained",null,{"$f":"'Step 2 - Order Planner'!B20","v":{"v":0,"d":"0%"}}]
["<Enter Business Name>","<Enter Business Name>",null,"Across-The-Course Rebate",null,{"$f":"'Step 2 - Order Planner'!B21","v":{"v":0,"d":"0%"}}]
["<City, ST Zip Code>","<City, ST Zip Code>",null,"Insignia® Intrinsic® Kicker - 5%",null,{"$f":"'Step 2 - Order Planner'!B22","v":0}]
["<Phone>","<Phone>",null,"Honor® Intrinsic® Kicker - 5%",null,{"$f":"'Step 2 - Order Planner'!B23","v":0}]
["<email address>","<email address>",null,"Total EOP Rebate",null,{"$f":"'Step 2 - Order Planner'!H23","v":0}]
{"$rows_left_out":54}
{"sheet":"Range Reference","index":4,"n_rows":23,"n_cols":24,"rows_kept":23,"hidden":true,"merged":[[1,16,2,16],[1,17,2,17],[1,18,2,18],[4,16,5,16],[4,17,5,17],[4,18,5,18],[5,2,5,3],[6,16,7,16],[6,17,7,17],[6,18,7,18],[9,16,10,16],[9,17,10,17],[9,18,10,18],[11,16,12,16],[11,17,12,17],[11,18,12,18],[13,16,15,16],[13,17,15,17],[13,18,15,18],[15,2,15,3],[22,2,22,3]]}
["Standard",null,"Oct","Nov-Dec",{"$nulls":7},"Article#","Article","Package","Oct Order","Nov-Dec Order","Oct Count","Nov-Dec Count","Total","Case Size","Total Vol","Gal/LB Coversion","Gal/LB Volume"]
["Low","High","Discount","Discount","Oct Applied",null,"Rebate Applied",{"$nulls":4},59021463,{"$f":"VLOOKUP($L2,'Article Reference'!$A$3:$C$15,2,FALSE)","v":"Emerald® fungicide"},{"$f":"VLOOKUP($L2,'Article Reference'!$A$3:$C$15,3,FALSE)","v":"10 x 0.49 lb"},{"$f":"VLOOKUP(L2,'Step 2 - Order Planner'!$C$26:$F$38,4,FALSE)","v":0},{"$f":"VLOOKUP(L2,'Step 2 - Order Planner'!$C$26:$H$38,6,FALSE)","v":0},{"$f":"IF(O2+O3>0,1,0)","v":0},{"$f":"IF(P2+P3>0,1,0)","v":0},{"$f":"IF(OR(Q2=1,R2=1),1,0)","v":0}]
[{"v":3000,"d":"$3,000.00"},{"$f":"A4-1","v":{"v":7999,"d":"$7,999.00"}},{"v":0.04,"d":"4%"},{"v":0.04,"d":"4%"},{"$f":"IF(AND(('Step 2 - Order Planner'!$H$19+$E$7)>=3000,'Step 2 - Order Planner'!$H$19+$E$7>=$A3,'Step 2 - Order Planner'!$H$19+$E$7<=$B3),C3)","v":false},null,{"$f":"SUM(E3:F3)","v":{"v":0,"d":"0%"}}]
[{"v":8000,"d":"$8,000.00"},{"$f":"A5-1","v":{"v":19999,"d":"$19,999.00"}},{"v":0.06,"d":"6%"},{"v":0.06,"d":"6%"},{"$f":"IF(AND(('Step 2 - Order Planner'!$H$19+$E$7)>=3000,'Step 2 - Order Planner'!$H$19+$E$7>=$A4,'Step 2 - Order Planner'!$H$19+$E$7<=$B4),C4)","v":false},null,{"$f":"SUM(E4:F4)","v":{"v":0,"d":"0%"}},{"$nulls":4},59014003,{"$f":"VLOOKUP($L4,'Article Reference'!$A$3:$C$15,2,FALSE)","v":"Encartis® fungicide"},{"$f":"VLOOKUP($L4,'Article Reference'!$A$3:$C$15,3,FALSE)","v":"2 x 2.5 gal"},{"$f":"VLOOKUP(L4,'Step 2 - Order Planner'!$C$26:$F$38,4,FALSE)","v":0},{"$f":"VLOOKUP(L4,'Step 2 - Order Planner'!$C$26:$H$38,6,FALSE)","v":0},{"$f":"IF(O4>0,1,0)","v":0},{"$f":"IF(P4>0,1,0)","v":0},{"$f":"IF(OR(Q4=1,R4=1),1,0)","v":0}]
[{"v":20000,"d":"$20,000.00"},{"v":1000000,"d":"$1,000,000.00"},{"v":0.12,"d":"12%"},{"v":0.12,"d":"12%"},{"$f":"IF(AND(('Step 2 - Order Planner'!$H$19+$E$7)>=3000,'Step 2 - Order Planner'!$H$19+$E$7>=$A5,'Step 2 - Order Planner'!$H$19+$E$7<=$B5),C5)","v":false},null,{"$f":"SUM(E5:F5)","v":{"v":0,"d":"0%"}},{"$nulls":4},59012350,{"$f":"VLOOKUP($L5,'Article Reference'!$A$3:$C$15,2,FALSE)","v":"Honor® Intrinsic® brand fungicide"},{"$f":"VLOOKUP($L5,'Article Reference'!$A$3:$C$15,3,FALSE)","v":"6 x 3 lb"},{"$f":"VLOOKUP(L5,'Step 2 - Order Planner'!$C$26:$F$38,4,FALSE)","v":0},{"$f":"VLOOKUP(L5,'Step 2 - Order Planner'!$C$26:$H$38,6,FALSE)","v":0},{"$f":"IF(O5+O6>0,1,0)","v":0},{"$f":"IF(P5+P6>0,1,0)","v":0},{"$f":"IF(OR(Q5=1,R5=1),1,0)","v":0},{"$f":"6*3","v":18},{"$f":"(O5+P5)*T5","v":0},1,{"$f":"V5*U5","v":0}]
[null,null,"DISCOUNT",null,{"$f":"SUM(E3:E5)","v":{"v":0,"d":"0%"}},null,{"$f":"SUM(E6:F6)","v":{"v":0,"d":"0%"}},{"$nulls":4},59012885,{"$f":"VLOOKUP($L6,'Article Reference'!$A$3:$C$15,2,FALSE)","v":"Honor® Intrinsic® brand fungicide"},{"$f":"VLOOKUP($L6,'Article Reference'!$A$3:$C$15,3,FALSE)","v":"1 x 36 lb"},{"$f":"VLOOKUP(L6,'Step 2 - Order Planner'!$C$26:$F$38,4,FALSE)","v":0},{"$f":"VLOOKUP(L6,'Step 2 - Order Planner'!$C$26:$H$38,6,FALSE)","v":0},{"$nulls":3},{"$f":"1*36","v":36},{"$f":"(O6+P6)*T6","v":0},1,{"$f":"V6*U6","v":0}]
[{"$nulls":4},0,{"$nulls":6},59014134,{"$f":"VLOOKUP($L7,'Article Reference'!$A$3:$C$15,2,FALSE)","v":"Insignia® SC Intrinsic® brand fungicide"},{"$f":"VLOOKUP($L7,'Article Reference'!$A$3:$C$15,3,FALSE)","v":"4 x 30.5 fl oz"},{"$f":"VLOOKUP(L7,'Step 2 - Order Planner'!$C$26:$F$38,4,FALSE)","v":0},{"$f":"VLOOKUP(L7,'Step 2 - Order Planner'!$C$26:$H$38,6,FALSE)","v":0},{"$f":"IF(O7+O8>0,1,0)","v":0},{"$f":"IF(P7+P8>0,1,0)","v":0},{"$f":"IF(OR(Q7=1,R7=1),1,0)","v":0},{"$f":"4*30.5","v":122},{"$f":"(O7+P7)*T7","v":0},7.8125E-3,{"$f":"V7*U7","v":0}]
[{"$nulls":11},59014135,{"$f":"VLOOKUP($L8,'Article Reference'!$A$3:$C$15,2,FALSE)","v":"Insignia® SC Intrinsic® brand fungicide"},{"$f":"VLOOKUP($L8,'Article Reference'!$A$3:$C$15,3,FALSE)","v":"2 x 2.5 gal"},{"$f":"VLOOKUP(L8,'Step 2 - Order Planner'!$C$26:$F$38,4,FALSE)","v":0},{"$f":"VLOOKUP(L8,'Step 2 - Order Planner'!$C$26:$H$38,6,FALSE)","v":0},{"$nulls":3},5,{"$f":"(O8+P8)*T8","v":0},1,{"$f":"V8*U8","v":0}]
["DYOP",null,"Oct","Nov-Dec",{"$nulls":7},59027998,{"$f":"VLOOKUP($L9,'Article Reference'!$A$3:$C$15,2,FALSE)","v":"Lexicon® Intrinsic® brand fungicide"},{"$f":"VLOOKUP($L9,'Article Reference'!$A$3:$C$15,3,FALSE)","v":"4 x 21 oz"},{"$f":"VLOOKUP(L9,'Step 2 - Order Planner'!$C$26:$F$38,4,FALSE)","v":0},{"$f":"VLOOKUP(L9,'Step 2 - Order Planner'!$C$26:$H$38,6,FALSE)","v":0},{"$f":"IF(O9>0,1,0)","v":0},{"$f":"IF(P9>0,1,0)","v":0},{"$f":"IF(OR(Q9=1,R9=1),1,0)","v":0}]
["Low","High","Discount","Discount","Oct Applied","Nov-Dec Applied","Rebate Applied",{"$f":"'Step 2 - Order Planner'!H17:I17","v":0},{"$nulls":3},59018087,{"$f":"VLOOKUP($L10,'Article Reference'!$A$3:$C$15,2,FALSE)","v":"Maxtima® fungicide"},{"$f":"VLOOKUP($L10,'Article Reference'!$A$3:$C$15,3,FALSE)","v":"4 x 26 oz"},{"$f":"VLOOKUP(L10,'Step 2 - Order Planner'!$C$26:$F$38,4,FALSE)","v":0},{"$f":"VLOOKUP(L10,'Step 2 - Order Planner'!$C$26:$H$38,6,FALSE)","v":0},{"$f":"IF(O10+O11>0,1,0)","v":0},{"$f":"IF(P10+P11>0,1,0)","v":0},{"$f":"IF(OR(Q10=1,R10=1),1,0)","v":0}]
{"$rows_left_out":14}
{"sheet":"Article Reference","index":5,"n_rows":51,"n_cols":12,"rows_kept":51,"hidden":true,"merged":[[0,0,0,4],[16,0,16,4]]}
["2022 Qualifying Fungicides"]
["Article Number","Qaulifying Non-Agency Products","Package","Price","CA Redemption","Case UOM","Price/UOM","Case Price"]
[59021463,"Emerald® fungicide","10 x 0.49 lb",{"v":1187.4,"d":"$1,187.40"},{"v":1213.2,"d":"$1,213.20"},{"$f":"10*0.49","v":4.9},{"$f":"H3/F3","v":{"v":242.3265306122449,"d":"$242.33"}},{"$f":"D3","v":{"v":1187.4,"d":"$1,187.40"}}]
[59014003,"Encartis® fungicide","2 x 2.5 gal",{"v":645.66,"d":"$645.66"},{"v":659.7,"d":"$659.70"},{"$f":"2*2.5","v":5},{"$f":"H4/F4","v":{"v":129.132,"d":"$129.13"}},{"$f":"D4","v":{"v":645.66,"d":"$645.66"}}]
[59012350,"Honor® Intrinsic® brand fungicide","6 x 3 lb",{"v":3303.54,"d":"$3,303.54"},{"v":3375.36,"d":"$3,375.36"},{"$f":"6*3","v":18},{"v":183.53,"d":"$183.53"},{"v":3303.54,"d":"$3,303.54"}]
[59012885,"Honor® Intrinsic® brand fungicide","1 x 36 lb",{"v":4867.2,"d":"$4,867.20"},{"v":4973.04,"d":"$4,973.04"},36,{"v":135.2,"d":"$135.20"},{"v":4867.2,"d":"$4,867.20"}]
[59014134,"Insignia® SC Intrinsic® brand fungicide","4 x 30.5 fl oz",{"v":2169.16,"d":"$2,169.16"},{"v":2216.76,"d":"$2,216.76"},{"$f":"4*30.5","v":122},{"v":17.779999999999998,"d":"$17.78"},{"v":2169.16,"d":"$2,169.16"}]
[59014135,"Insignia® SC Intrinsic® brand fungicide","2 x 2.5 gal",{"v":7225.1,"d":"$7,225.10"},{"v":7382.26,"d":"$7,382.26"},5,{"v":1445.02,"d":"$1,445.02"},{"v":7225.1,"d":"$7,225.10"}]
[59027998,"Lexicon® Intrinsic® brand fungicide","4 x 21 oz",{"v":2418.36,"d":"$2,418.36"},{"v":2471.28,"d":"$2,471.28"},{"$f":"4*21","v":84},{"v":28.790000000000003,"d":"$28.79"},{"v":2418.36,"d":"$2,418.36"}]
[59018087,"Maxtima® fungicide","4 x 26 oz",{"v":907.92,"d":"$907.92"},{"v":927.68,"d":"$927.68"},{"$f":"4*26","v":104},{"v":8.73,"d":"$8.73"},{"v":907.92,"d":"$907.92"}]
{"$rows_left_out":42}
{"sheet":"Coverage Reference","index":6,"n_rows":39,"n_cols":13,"rows_kept":39,"hidden":true,"merged":[[1,0,1,1]]}
["Calculator Acreage"]
["Acre Coverage",{"$nulls":3},4,5,6,7]
["Product Name","Article #","Package Size","Price/Case","Low Rate","Mid Rate","Mid2 Rate","High rate",null,null,"Low Rate","Mid Rate","High rate"]
["Emerald® Fungicide",59021463,"10 x .49 lb.",{"$nulls":4},{"v":10,"d":"10.00"},null,null,{"v":13.9,"d":"13.90"},{"v":12,"d":"12.00"},{"v":10,"d":"10.00"}]
["Emerald® Fungicide",59012825,"50 x .49 lb.",{"$nulls":4},{"v":50,"d":"50.00"},null,null,{"v":69.3,"d":"69.30"},{"v":60,"d":"60.00"},{"v":50,"d":"50.00"}]
["Encartis® fungicide",59014003,"2 x 2.5 gal",null,null,{"v":4.9,"d":"4.90"},{"v":4.2,"d":"4.20"},{"v":3.7,"d":"3.70"},null,null,{"v":99,"d":"99.00"},{"v":99,"d":"99.00"},{"v":99,"d":"99.00"}]
["Honor® Intrinsic™ brand Fungicide",59012885,"1 x 36 lb",{"$nulls":4},{"v":12,"d":"12.00"},null,null,{"v":24,"d":"24.00"},{"v":18,"d":"18.00"},{"v":12,"d":"12.00"}]
["Honor® Intrinsic™ brand Fungicide",59012350,"6 x 3 lb",{"$nulls":4},{"v":6,"d":"6.00"},null,null,{"v":12,"d":"12.00"},{"v":9,"d":"9.00"},{"v":6,"d":"6.00"}]
["Insignia® SC Intrinsic™ brand Fungicide",59014135,"2 x 2.5 gal",{"$nulls":4},{"v":21,"d":"21.00"},null,null,{"v":36.8,"d":"36.80"},{"v":28.9,"d":"28.90"},{"v":21,"d":"21.00"}]
["Insignia® SC Intrinsic™ brand Fungicide",59014134,"4 x 30.5 oz",{"$nulls":4},{"v":4,"d":"4.00"},null,null,{"v":7,"d":"7.00"},{"v":5.5,"d":"5.50"},{"v":4,"d":"4.00"}]
{"$rows_left_out":30}
{"sheet":"Sheet1","index":7,"n_rows":19,"n_cols":16,"rows_kept":19,"hidden":true,"merged":[[11,10,11,12],[11,14,11,15],[12,10,13,10],[12,11,12,12],[12,14,13,14]]}
[]
[null,"Qualifying Fungicide EOP Purchase Level","October 1st - October 31st, 2021 Earned Rebate","November 1st - December 10th, 2021 Earned Incentive %","January 1 - September 30, 2021 Earned Incentive %",null,"Qualifying EOP Purchase Level (Excluding DYP Fungicides)","October 1st - December 4th, 2021 Earned Rebate","January 1 - September 30, 2022 Earned Incentive %",null,"Qualifying Fungicide EOP Purchase Level","October 1st - October 31st, 2021 Earned Rebate","November 1st - December 3rd, 2021 Earned Incentive %",null,"Qualifying EOP Purchase Level (Excluding DYP Fungicides)","October 1st - December 3rd, 2021 Earned Rebate"]
[null,"$5,000-$14,999",{"v":0.12,"d":"12%"},{"v":0.06,"d":"6%"},"-",null,"$2,000-$6,999",{"v":0.04,"d":"4%"},"-",null,"$5,000-$14,999",{"v":0.12,"d":"12%"},{"v":0.08,"d":"8%"},null,"$2,000-$6,999",{"v":0.04,"d":"4%"}]
[null,"$15,000-$24,999",{"v":0.16,"d":"16%"},{"v":0.08,"d":"8%"},"-",null,"$7,000-$14,999",{"v":0.06,"d":"6%"},"-",null,"$15,000-$24,999",{"v":0.16,"d":"16%"},{"v":0.1,"d":"10%"},null,"$7,000-$14,999",{"v":0.06,"d":"6%"}]
[null,"$25,000-$34,999",{"v":0.2,"d":"20%"},{"v":0.1,"d":"10%"},{"v":0.07,"d":"7%"},null,"$15,000+",{"v":0.1,"d":"10%"},"$25,000-$34,999 =  7%",null,"$25,000-$34,999",{"v":0.2,"d":"20%"},{"v":0.12,"d":"12%"},null,"$15,000+",{"v":0.1,"d":"10%"}]
[null,"$35,000+",{"v":0.24,"d":"24%"},{"v":0.12,"d":"12%"},{"v":0.1,"d":"10%"},{"$nulls":3},"$35,000+ = 10%",null,"$35,000+",{"v":0.24,"d":"24%"},{"v":0.14,"d":"14%"}]
[null,"$25,000-$34,999",{"v":0.2,"d":"20%"},{"v":0.1,"d":"10%"},{"v":0.07,"d":"7%"},null,"$15,000+",{"v":0.1,"d":"10%"},"$25,000-$34,999 =  7%"]
[]
[]
[]
{"$rows_left_out":9}